Reaction Details
TargetPatatin-like phospholipase domain-containing protein 2
LigandBDBM50084917
Substrate/Competitorn/a
Meas. Tech.ChEMBL_1476694 (CHEMBL3428915)
IC50 50000±n/a nM
Citation Mayer, NSchweiger, MMelcher, MCFledelius, CZechner, RZimmermann, RBreinbauer, R Structure-activity studies in the development of a hydrazone based inhibitor of adipose-triglyceride lipase (ATGL). Bioorg Med Chem23:2904-16 (2015) 
 
Patatin-like phospholipase domain-containing protein 2
Name:Patatin-like phospholipase domain-containing protein 2
Type:PROTEIN
Mol. Mass.:53655.79
Organism:Mus musculus
Description:ChEMBL_109612
Residue:486
BDBM50084917
NameBDBM50084917
Synonyms:CHEMBL3427354
TypeSmall organic molecule
Emp. Form.C17H18FN3O2
Mol. Mass.315.3421
SMILESOc1ccc(\C=N\N2CCN(CC2)c2ccc(F)cc2)c(O)c1