Reaction Details
TargetCyclin-G-associated kinase
LigandBDBM50086262
Substrate/Competitorn/a
Meas. Tech.ChEMBL_1478106 (CHEMBL3430283)
Kd 47±n/a nM
Citation Kovackova, SChang, LBekerman, ENeveu, GBarouch-Bentov, RChaikuad, AHeroven, C?ála, MDe Jonghe, SKnapp, SEinav, SHerdewijn, P Selective Inhibitors of Cyclin G Associated Kinase (GAK) as Anti-Hepatitis C Agents. J Med Chem58:3393-410 (2015) 
 
Cyclin-G-associated kinase
Name:Cyclin-G-associated kinase
Type:PROTEIN
Mol. Mass.:143171.28
Organism:Homo sapiens (Human)
Description:ChEMBL_1478229
Residue:1311
BDBM50086262
NameBDBM50086262
Synonyms:CHEMBL3425859
TypeSmall organic molecule
Emp. Form.C14H13N3OS2
Mol. Mass.303.403
SMILESC1CN(CCO1)c1snc2cc(cnc12)-c1cccs1