Reaction Details
TargetCyclin-G-associated kinase
LigandBDBM50086269
Substrate/Competitorn/a
Meas. Tech.ChEMBL_1478106 (CHEMBL3430283)
Kd 18±n/a nM
Citation Kovackova, SChang, LBekerman, ENeveu, GBarouch-Bentov, RChaikuad, AHeroven, C?ála, MDe Jonghe, SKnapp, SEinav, SHerdewijn, P Selective Inhibitors of Cyclin G Associated Kinase (GAK) as Anti-Hepatitis C Agents. J Med Chem58:3393-410 (2015) 
 
Cyclin-G-associated kinase
Name:Cyclin-G-associated kinase
Type:PROTEIN
Mol. Mass.:143171.28
Organism:Homo sapiens (Human)
Description:ChEMBL_1478229
Residue:1311
BDBM50086269
NameBDBM50086269
Synonyms:CHEMBL3425868
TypeSmall organic molecule
Emp. Form.C17H17N3O3S
Mol. Mass.343.4
SMILESCOc1cc(ccc1O)-c1cnc2c(snc2c1)N1CCOCC1