Reaction Details
TargetCyclin-G-associated kinase
LigandBDBM50086270
Substrate/Competitorn/a
Meas. Tech.ChEMBL_1478106 (CHEMBL3430283)
Kd 190±n/a nM
Citation Kovackova, SChang, LBekerman, ENeveu, GBarouch-Bentov, RChaikuad, AHeroven, C?ála, MDe Jonghe, SKnapp, SEinav, SHerdewijn, P Selective Inhibitors of Cyclin G Associated Kinase (GAK) as Anti-Hepatitis C Agents. J Med Chem58:3393-410 (2015) 
 
Cyclin-G-associated kinase
Name:Cyclin-G-associated kinase
Type:PROTEIN
Mol. Mass.:143171.28
Organism:Homo sapiens (Human)
Description:ChEMBL_1478229
Residue:1311
BDBM50086270
NameBDBM50086270
Synonyms:CHEMBL3425869
TypeSmall organic molecule
Emp. Form.C16H17N3O2S
Mol. Mass.315.39
SMILESCOc1ccc(cc1OC)-c1cnc2c(snc2c1)N(C)C