Reaction Details
TargetCyclin-G-associated kinase
LigandBDBM50086280
Substrate/Competitorn/a
Meas. Tech.ChEMBL_1478106 (CHEMBL3430283)
Kd 2000±n/a nM
Citation Kovackova, SChang, LBekerman, ENeveu, GBarouch-Bentov, RChaikuad, AHeroven, C?ála, MDe Jonghe, SKnapp, SEinav, SHerdewijn, P Selective Inhibitors of Cyclin G Associated Kinase (GAK) as Anti-Hepatitis C Agents. J Med Chem58:3393-410 (2015) 
 
Cyclin-G-associated kinase
Name:Cyclin-G-associated kinase
Type:PROTEIN
Mol. Mass.:143171.28
Organism:Homo sapiens (Human)
Description:ChEMBL_1478229
Residue:1311
BDBM50086280
NameBDBM50086280
Synonyms:CHEMBL3425880
TypeSmall organic molecule
Emp. Form.C10H13N3OS
Mol. Mass.223.295
SMILESCCc1nc2sc(C)c(C)c2c(=O)n1N