Reaction Details
TargetMacrophage colony-stimulating factor 1 receptor
LigandBDBM50086266
Substrate/Competitorn/a
Meas. Tech.ChEMBL_1478118 (CHEMBL3430295)
Kd 320±n/a nM
Citation Kovackova, SChang, LBekerman, ENeveu, GBarouch-Bentov, RChaikuad, AHeroven, C?ála, MDe Jonghe, SKnapp, SEinav, SHerdewijn, P Selective Inhibitors of Cyclin G Associated Kinase (GAK) as Anti-Hepatitis C Agents. J Med Chem58:3393-410 (2015) 
 
Macrophage colony-stimulating factor 1 receptor
Name:Macrophage colony-stimulating factor 1 receptor
Type:Protein
Mol. Mass.:107979.48
Organism:Homo sapiens (Human)
Description:P07333
Residue:972
BDBM50086266
NameBDBM50086266
Synonyms:CHEMBL3425865
TypeSmall organic molecule
Emp. Form.C19H21N3O4S
Mol. Mass.387.453
SMILESCOc1cc(cc(OC)c1OC)-c1cnc2c(snc2c1)N1CCOCC1