Reaction Details
TargetPlatelet-derived growth factor receptor beta
LigandBDBM50086266
Substrate/Competitorn/a
Meas. Tech.ChEMBL_1478123 (CHEMBL3430300)
Kd 70±n/a nM
Citation Kovackova, SChang, LBekerman, ENeveu, GBarouch-Bentov, RChaikuad, AHeroven, C?ála, MDe Jonghe, SKnapp, SEinav, SHerdewijn, P Selective Inhibitors of Cyclin G Associated Kinase (GAK) as Anti-Hepatitis C Agents. J Med Chem58:3393-410 (2015) 
 
Platelet-derived growth factor receptor beta
Name:Platelet-derived growth factor receptor beta
Type:Enzyme
Mol. Mass.:123922.25
Organism:Homo sapiens (Human)
Description:P09619
Residue:1106
BDBM50086266
NameBDBM50086266
Synonyms:CHEMBL3425865
TypeSmall organic molecule
Emp. Form.C19H21N3O4S
Mol. Mass.387.453
SMILESCOc1cc(cc(OC)c1OC)-c1cnc2c(snc2c1)N1CCOCC1