Reaction Details
TargetInduced myeloid leukemia cell differentiation protein Mcl-1
LigandBDBM50086686
Substrate/Competitorn/a
Meas. Tech.ChEMBL_1477328 (CHEMBL3429294)
Ki 410±n/a nM
Citation Burke, JPBian, ZShaw, SZhao, BGoodwin, CMBelmar, JBrowning, CFVigil, DFriberg, ACamper, DVRossanese, OWLee, TOlejniczak, ETFesik, SW Discovery of tricyclic indoles that potently inhibit Mcl-1 using fragment-based methods and structure-based design. J Med Chem58:3794-805 (2015) 
 
Induced myeloid leukemia cell differentiation protein Mcl-1
Name:Induced myeloid leukemia cell differentiation protein Mcl-1
Type:Membrane; Single-pass membrane protein
Mol. Mass.:37332.87
Organism:Homo sapiens (Human)
Description:Q07820
Residue:350
BDBM50086686
NameBDBM50086686
Synonyms:CHEMBL3426327
TypeSmall organic molecule
Emp. Form.C24H25NO3S
Mol. Mass.407.525
SMILESOC(=O)c1c(CCCOc2ccc3CCCCc3c2)c2cccc3SCCn1c23