Reaction Details
TargetInduced myeloid leukemia cell differentiation protein Mcl-1
LigandBDBM50086687
Substrate/Competitorn/a
Meas. Tech.ChEMBL_1477328 (CHEMBL3429294)
Ki 210±n/a nM
Citation Burke, JPBian, ZShaw, SZhao, BGoodwin, CMBelmar, JBrowning, CFVigil, DFriberg, ACamper, DVRossanese, OWLee, TOlejniczak, ETFesik, SW Discovery of tricyclic indoles that potently inhibit Mcl-1 using fragment-based methods and structure-based design. J Med Chem58:3794-805 (2015) 
 
Induced myeloid leukemia cell differentiation protein Mcl-1
Name:Induced myeloid leukemia cell differentiation protein Mcl-1
Type:Membrane; Single-pass membrane protein
Mol. Mass.:37332.87
Organism:Homo sapiens (Human)
Description:Q07820
Residue:350
BDBM50086687
NameBDBM50086687
Synonyms:CHEMBL3426328
TypeSmall organic molecule
Emp. Form.C21H20ClNO3S
Mol. Mass.401.906
SMILESCc1cc(OCCCc2c(C(O)=O)n3CCSc4cccc2c34)ccc1Cl