Reaction Details
TargetInduced myeloid leukemia cell differentiation protein Mcl-1
LigandBDBM50086692
Substrate/Competitorn/a
Meas. Tech.ChEMBL_1477328 (CHEMBL3429294)
Ki 3.0±n/a nM
Citation Burke, JPBian, ZShaw, SZhao, BGoodwin, CMBelmar, JBrowning, CFVigil, DFriberg, ACamper, DVRossanese, OWLee, TOlejniczak, ETFesik, SW Discovery of tricyclic indoles that potently inhibit Mcl-1 using fragment-based methods and structure-based design. J Med Chem58:3794-805 (2015) 
 
Induced myeloid leukemia cell differentiation protein Mcl-1
Name:Induced myeloid leukemia cell differentiation protein Mcl-1
Type:Membrane; Single-pass membrane protein
Mol. Mass.:37332.87
Organism:Homo sapiens (Human)
Description:Q07820
Residue:350
BDBM50086692
NameBDBM50086692
Synonyms:CHEMBL3426333
TypeSmall organic molecule
Emp. Form.C23H23Cl2NO3
Mol. Mass.432.34
SMILESCc1cc(OCCCc2c(C(O)=O)n3CCCc4c(Cl)ccc2c34)cc(C)c1Cl