Reaction Details
TargetApoptosis regulator Bcl-2
LigandBDBM50086704
Substrate/Competitorn/a
Meas. Tech.ChEMBL_1477330 (CHEMBL3429296)
Ki 3700±n/a nM
Citation Burke, JPBian, ZShaw, SZhao, BGoodwin, CMBelmar, JBrowning, CFVigil, DFriberg, ACamper, DVRossanese, OWLee, TOlejniczak, ETFesik, SW Discovery of tricyclic indoles that potently inhibit Mcl-1 using fragment-based methods and structure-based design. J Med Chem58:3794-805 (2015) 
 
Apoptosis regulator Bcl-2
Name:Apoptosis regulator Bcl-2
Type:Homodimer or heterodimer
Mol. Mass.:26269.11
Organism:Homo sapiens (Human)
Description:P10415
Residue:239
BDBM50086704
NameBDBM50086704
Synonyms:CHEMBL3426325
TypeSmall organic molecule
Emp. Form.C24H25NO3S
Mol. Mass.407.525
SMILESOC(=O)c1c(CCCOc2cccc3CCCCc23)c2cccc3SCCn1c23