Reaction Details
TargetInduced myeloid leukemia cell differentiation protein Mcl-1
LigandBDBM50004955
Substrate/Competitorn/a
Meas. Tech.ChEMBL_1477328 (CHEMBL3429294)
Ki>1000000±n/a nM
Citation Burke, JPBian, ZShaw, SZhao, BGoodwin, CMBelmar, JBrowning, CFVigil, DFriberg, ACamper, DVRossanese, OWLee, TOlejniczak, ETFesik, SW Discovery of tricyclic indoles that potently inhibit Mcl-1 using fragment-based methods and structure-based design. J Med Chem58:3794-805 (2015) 
 
Induced myeloid leukemia cell differentiation protein Mcl-1
Name:Induced myeloid leukemia cell differentiation protein Mcl-1
Type:Membrane; Single-pass membrane protein
Mol. Mass.:37332.87
Organism:Homo sapiens (Human)
Description:Q07820
Residue:350
BDBM50004955
NameBDBM50004955
Synonyms:1H-Indole-2-carboxylic acid Indol-2-carboxylic acid | Indole-2-carboxylate
TypeSmall organic molecule
Emp. Form.C9H7NO2
Mol. Mass.161.1574
SMILESOC(=O)c1cc2ccccc2[nH]1