Reaction Details
TargetInduced myeloid leukemia cell differentiation protein Mcl-1
LigandBDBM50086701
Substrate/Competitorn/a
Meas. Tech.ChEMBL_1477328 (CHEMBL3429294)
Ki 170±n/a nM
Citation Burke, JPBian, ZShaw, SZhao, BGoodwin, CMBelmar, JBrowning, CFVigil, DFriberg, ACamper, DVRossanese, OWLee, TOlejniczak, ETFesik, SW Discovery of tricyclic indoles that potently inhibit Mcl-1 using fragment-based methods and structure-based design. J Med Chem58:3794-805 (2015) 
 
Induced myeloid leukemia cell differentiation protein Mcl-1
Name:Induced myeloid leukemia cell differentiation protein Mcl-1
Type:Membrane; Single-pass membrane protein
Mol. Mass.:37332.87
Organism:Homo sapiens (Human)
Description:Q07820
Residue:350
BDBM50086701
NameBDBM50086701
Synonyms:CHEMBL3426322
TypeSmall organic molecule
Emp. Form.C25H23NO3S
Mol. Mass.417.52
SMILESOC(=O)c1c(CCCOc2cccc3ccccc23)c2cccc3SCCCn1c23