Reaction Details
TargetRho-associated protein kinase 2
LigandBDBM50087123
Substrate/Competitorn/a
Meas. Tech.ChEMBL_1478012 (CHEMBL3429820)
IC50 41±n/a nM
Citation Boland, SBourin, AAlen, JGeraets, JSchroeders, PCastermans, KKindt, NBoumans, NPanitti, LFransen, SVanormelingen, JStassen, JMLeysen, DDefert, O Design, synthesis, and biological evaluation of novel, highly active soft ROCK inhibitors. J Med Chem58:4309-24 (2015) 
 
Rho-associated protein kinase 2
Name:Rho-associated protein kinase 2
Type:Protein
Mol. Mass.:160885.43
Organism:Homo sapiens (Human)
Description:O75116
Residue:1388
BDBM50087123
NameBDBM50087123
Synonyms:CHEMBL3426642
TypeSmall organic molecule
Emp. Form.C32H28F2N4O4
Mol. Mass.570.5859
SMILESNCc1ccc(cc1-c1cccc(c1)C(=O)Nc1cccc(C(=O)OC2CCCC2)c1F)C(=O)Nc1ccncc1F