Reaction Details
TargetRho-associated protein kinase 2
LigandBDBM50087127
Substrate/Competitorn/a
Meas. Tech.ChEMBL_1478012 (CHEMBL3429820)
IC50 2.1±n/a nM
Citation Boland, SBourin, AAlen, JGeraets, JSchroeders, PCastermans, KKindt, NBoumans, NPanitti, LFransen, SVanormelingen, JStassen, JMLeysen, DDefert, O Design, synthesis, and biological evaluation of novel, highly active soft ROCK inhibitors. J Med Chem58:4309-24 (2015) 
 
Rho-associated protein kinase 2
Name:Rho-associated protein kinase 2
Type:Protein
Mol. Mass.:160885.43
Organism:Homo sapiens (Human)
Description:O75116
Residue:1388
BDBM50087127
NameBDBM50087127
Synonyms:CHEMBL3426637
TypeSmall organic molecule
Emp. Form.C28H23FN4O4
Mol. Mass.498.505
SMILESCOC(=O)c1cccc(c1)C(=O)Nc1cccc(c1)-c1cc(ccc1CN)C(=O)Nc1ccncc1F