Reaction Details
TargetRho-associated protein kinase 1
LigandBDBM50087132
Substrate/Competitorn/a
Meas. Tech.ChEMBL_1478010 (CHEMBL3429818)
IC50<1.000000±n/a nM
Citation Boland, SBourin, AAlen, JGeraets, JSchroeders, PCastermans, KKindt, NBoumans, NPanitti, LFransen, SVanormelingen, JStassen, JMLeysen, DDefert, O Design, synthesis, and biological evaluation of novel, highly active soft ROCK inhibitors. J Med Chem58:4309-24 (2015) 
 
Rho-associated protein kinase 1
Name:Rho-associated protein kinase 1
Type:Serine/threonine-protein kinase
Mol. Mass.:158156.77
Organism:Homo sapiens (Human)
Description:Q13464
Residue:1354
BDBM50087132
NameBDBM50087132
Synonyms:CHEMBL3426623
TypeSmall organic molecule
Emp. Form.C29H25FN4O4
Mol. Mass.512.5316
SMILESCOC(=O)Cc1cccc(NC(=O)c2cccc(c2)-c2cc(ccc2CN)C(=O)Nc2ccncc2F)c1