Reaction Details
TargetRho-associated protein kinase 2
LigandBDBM50087168
Substrate/Competitorn/a
Meas. Tech.ChEMBL_1478012 (CHEMBL3429820)
IC50 1.4±n/a nM
Citation Boland, SBourin, AAlen, JGeraets, JSchroeders, PCastermans, KKindt, NBoumans, NPanitti, LFransen, SVanormelingen, JStassen, JMLeysen, DDefert, O Design, synthesis, and biological evaluation of novel, highly active soft ROCK inhibitors. J Med Chem58:4309-24 (2015) 
 
Rho-associated protein kinase 2
Name:Rho-associated protein kinase 2
Type:Protein
Mol. Mass.:160885.43
Organism:Homo sapiens (Human)
Description:O75116
Residue:1388
BDBM50087168
NameBDBM50087168
Synonyms:CHEMBL3426726
TypeSmall organic molecule
Emp. Form.C32H29FN4O4
Mol. Mass.552.5955
SMILESNCc1ccc(cc1-c1cccc(c1)C(=O)Nc1ccc(CC(=O)OC2CCC2)cc1)C(=O)Nc1ccncc1F