Reaction Details
TargetHeat shock protein 75 kDa, mitochondrial
LigandBDBM50165268
Substrate/Competitorn/a
Meas. Tech.ChEMBL_1478164 (CHEMBL3427925)
IC50 83600±n/a nM
Citation Patel, HJPatel, PDOchiana, SOYan, PSun, WPatel, MRShah, SKTramentozzi, EBrooks, JBolaender, AShrestha, LStephani, RFinotti, PLeifer, CLi, ZGewirth, DTTaldone, TChiosis, G Structure-activity relationship in a purine-scaffold compound series with selectivity for the endoplasmic reticulum Hsp90 paralog Grp94. J Med Chem58:3922-43 (2015) 
 
Heat shock protein 75 kDa, mitochondrial
Name:Heat shock protein 75 kDa, mitochondrial
Type:PROTEIN
Mol. Mass.:80120.13
Organism:Homo sapiens (Human)
Description:ChEMBL_1478164
Residue:704
BDBM50165268
NameBDBM50165268
Synonyms:8-(3,5-Dichloro-phenylsulfanyl)-9-pent-4-ynyl-9H-purin-6-ylamine | CHEMBL192013
TypeSmall organic molecule
Emp. Form.C16H13Cl2N5S
Mol. Mass.378.279
SMILESNc1ncnc2n(CCCC#C)c(Sc3cc(Cl)cc(Cl)c3)nc12