Reaction Details
TargetHeat shock protein 75 kDa, mitochondrial
LigandBDBM50087575
Substrate/Competitorn/a
Meas. Tech.ChEMBL_1478164 (CHEMBL3427925)
IC50 4980±n/a nM
Citation Patel, HJPatel, PDOchiana, SOYan, PSun, WPatel, MRShah, SKTramentozzi, EBrooks, JBolaender, AShrestha, LStephani, RFinotti, PLeifer, CLi, ZGewirth, DTTaldone, TChiosis, G Structure-activity relationship in a purine-scaffold compound series with selectivity for the endoplasmic reticulum Hsp90 paralog Grp94. J Med Chem58:3922-43 (2015) 
 
Heat shock protein 75 kDa, mitochondrial
Name:Heat shock protein 75 kDa, mitochondrial
Type:PROTEIN
Mol. Mass.:80120.13
Organism:Homo sapiens (Human)
Description:ChEMBL_1478164
Residue:704
BDBM50087575
NameBDBM50087575
Synonyms:CHEMBL3426763
TypeSmall organic molecule
Emp. Form.C17H13Cl2N5O
Mol. Mass.374.224
SMILESNc1ncnc2n(CCCC#C)c(nc12)C(=O)c1ccc(Cl)cc1Cl