Reaction Details
TargetHistone deacetylase 6
LigandBDBM50087845
Substrate/Competitorn/a
Meas. Tech.ChEMBL_1478439 (CHEMBL3429377)
IC50 7.0±n/a nM
Citation Di Pompo, GSalerno, MRotili, DValente, SZwergel, CAvnet, SLattanzi, GBaldini, NMai, A Novel histone deacetylase inhibitors induce growth arrest, apoptosis, and differentiation in sarcoma cancer stem cells. J Med Chem58:4073-9 (2015) 
 
Histone deacetylase 6
Name:Histone deacetylase 6
Type:Chromatin regulator; hydrolase; repressor
Mol. Mass.:131381.51
Organism:Homo sapiens (Human)
Description:Q9UBN7
Residue:1215
BDBM50087845
NameBDBM50087845
Synonyms:CHEMBL3426803
TypeSmall organic molecule
Emp. Form.C21H21N3O3S
Mol. Mass.395.475
SMILESONC(=O)CCCCSc1nc(cc(=O)[nH]1)-c1ccc(cc1)-c1ccccc1