Reaction Details
TargetHistone deacetylase 1
LigandBDBM50087845
Substrate/Competitorn/a
Meas. Tech.ChEMBL_1478434 (CHEMBL3429372)
IC50 100±n/a nM
Citation Di Pompo, GSalerno, MRotili, DValente, SZwergel, CAvnet, SLattanzi, GBaldini, NMai, A Novel histone deacetylase inhibitors induce growth arrest, apoptosis, and differentiation in sarcoma cancer stem cells. J Med Chem58:4073-9 (2015) 
 
Histone deacetylase 1
Name:Histone deacetylase 1
Type:Enzyme
Mol. Mass.:55090.27
Organism:Homo sapiens (Human)
Description:Q13547
Residue:482
BDBM50087845
NameBDBM50087845
Synonyms:CHEMBL3426803
TypeSmall organic molecule
Emp. Form.C21H21N3O3S
Mol. Mass.395.475
SMILESONC(=O)CCCCSc1nc(cc(=O)[nH]1)-c1ccc(cc1)-c1ccccc1