Reaction Details
TargetHistone deacetylase 8
LigandBDBM19149
Substrate/Competitorn/a
Meas. Tech.ChEMBL_1476051 (CHEMBL3428547)
IC50 5.5±n/a nM
Citation Duan, WLi, JInks, ESChou, CJJia, YChu, XLi, XXu, WZhang, Y Design, synthesis, and antitumor evaluation of novel histone deacetylase inhibitors equipped with a phenylsulfonylfuroxan module as a nitric oxide donor. J Med Chem58:4325-38 (2015) 
 
Histone deacetylase 8
Name:Histone deacetylase 8
Type:Enzyme
Mol. Mass.:41749.60
Organism:Homo sapiens (Human)
Description:Q9BY41
Residue:377
BDBM19149
NameBDBM19149
Synonyms:CHEMBL98 SAHA US10188756, Compound SAHA US11505523, Compound SAHA US9353061, SAHA US9695181, Vorinostat Zolinza suberoylanilide hydroxamic acid
TypeSmall organic molecule
Emp. Form.C14H20N2O3
Mol. Mass.264.3202
SMILESONC(=O)CCCCCCC(=O)Nc1ccccc1