Reaction Details
TargetC-X-C chemokine receptor type 2
LigandBDBM150811
Substrate/Competitorn/a
Meas. Tech.ChEMBL_1476503 (CHEMBL3427962)
IC50 356±n/a nM
Citation Maeda, DYPeck, AMSchuler, ADQuinn, MTKirpotina, LNWicomb, WNAuten, RLGundla, RZebala, JA Boronic acid-containing CXCR1/2 antagonists: Optimization of metabolic stability, in vivo evaluation, and a proposed receptor binding model. Bioorg Med Chem Lett25:2280-4 (2015) 
 
C-X-C chemokine receptor type 2
Name:C-X-C chemokine receptor type 2
Type:Protein
Mol. Mass.:40767.88
Organism:Homo sapiens (Human)
Description:P25025
Residue:360
BDBM150811
NameBDBM150811
Synonyms:US8981106, 1 (SX-517) | USRE47267, Compound 1
TypeSmall organic molecule
Emp. Form.C19H16BFN2O3S
Mol. Mass.382.216
SMILESOB(O)c1ccccc1CSc1ccc(cn1)C(=O)Nc1ccc(F)cc1