Reaction Details
TargetLow molecular weight phosphotyrosine protein phosphatase
LigandBDBM50104677
Substrate/Competitorn/a
Meas. Tech.ChEMBL_1476527 (CHEMBL3428078)
IC50 2500±n/a nM
Citation Carneiro, VMTrivella, DBScorsato, VBeraldo, VLDias, MPSobreira, TJAparicio, RPilli, RA Is RK-682 a promiscuous enzyme inhibitor? Synthesis and in vitro evaluation of protein tyrosine phosphatase inhibition of racemic RK-682 and analogues. Eur J Med Chem97:42-54 (2015) 
 
Low molecular weight phosphotyrosine protein phosphatase
Name:Low molecular weight phosphotyrosine protein phosphatase
Type:n/a
Mol. Mass.:18042.81
Organism:Homo sapiens (Human)
Description:P24666
Residue:158
BDBM50104677
NameBDBM50104677
Synonyms:3-Hexadecanoyl-4-hydroxy-5-methylene-5H-furan-2-one | CHEMBL110642
TypeSmall organic molecule
Emp. Form.C21H34O4
Mol. Mass.350.4923
(=O)C1C(=O)OC(=C)C1=O