Reaction Details
TargetHistamine H3 receptor
LigandBDBM50088058
Substrate/Competitorn/a
Meas. Tech.ChEMBL_1476599 (CHEMBL3428418)
IC50 0.970000±n/a nM
Citation Blass, B Biphenyl-ethyl-pyrrolidine derivatives as histamine h3 receptor modulators for the treatment of cognitive disorders. ACS Med Chem Lett6:235-6 (2015) 
 
Histamine H3 receptor
Name:Histamine H3 receptor
Type:G Protein-Coupled Receptor (GPCR)
Mol. Mass.:48691.47
Organism:Homo sapiens (Human)
Description:Binding assays were using CHO cells stably expressing hH3R receptors.
Residue:445
BDBM50088058
NameBDBM50088058
Synonyms:CHEMBL3427245 | US9365511, 45
TypeSmall organic molecule
Emp. Form.C23H29NO2
Mol. Mass.351.4819
SMILESC[C@@H]1CCCN1CCc1ccc(cc1)-c1ccc(CCCC(O)=O)cc1