Reaction Details
TargetPotassium voltage-gated channel subfamily H member 2
LigandBDBM50334986
Substrate/Competitorn/a
Meas. Tech.ChEMBL_1478865 (CHEMBL3430337)
IC50 39811±n/a nM
Citation Mirams, GRDavies, MRBrough, SJBridgland-Taylor, MHCui, YGavaghan, DJAbi-Gerges, N Prediction of Thorough QT study results using action potential simulations based on ion channel screens. J Pharmacol Toxicol Methods70:246-54 (2014) 
 
Potassium voltage-gated channel subfamily H member 2
Name:Potassium voltage-gated channel subfamily H member 2
Type:Multi-pass membrane protein
Mol. Mass.:126672.65
Organism:Homo sapiens (Human)
Description:Q12809
Residue:1159
BDBM50334986
NameBDBM50334986
Synonyms:4,4-Difluoro-cyclohexanecarboxylic acid {(S)-3-[(1S,5S)-3-(3-isopropyl-5-methyl-[1,2,4]triazol-4-yl)-8-aza-bicyclo[3.2.1]oct-8-yl]-1-phenyl-propyl}-amide 4,4-difluoro-N-((S)-3-((1S,3S,5R)-3-(3-isopropyl-5-methyl-4H-1,2,4-triazol-4-yl)-8-aza-bicyclo[3.2.1]octan-8-yl)-1-phenylpropyl)cyclohexanecarboxamide CHEMBL1201187 Selzentry | UK-427857
TypeSmall organic molecule
Emp. Form.C29H41F2N5O
Mol. Mass.513.6655
SMILESCC(C)c1nnc(C)n1[C@H]1C[C@@H]2CC[C@H](C1)N2CC[C@H](NC(=O)C1CCC(F)(F)CC1)c1ccccc1