Reaction Details
TargetPotassium voltage-gated channel subfamily H member 2
LigandBDBM50088378
Substrate/Competitorn/a
Meas. Tech.ChEMBL_1478801 (CHEMBL3430702)
IC50 15848932±n/a nM
Citation Mirams, GRDavies, MRBrough, SJBridgland-Taylor, MHCui, YGavaghan, DJAbi-Gerges, N Prediction of Thorough QT study results using action potential simulations based on ion channel screens. J Pharmacol Toxicol Methods70:246-54 (2014) 
 
Potassium voltage-gated channel subfamily H member 2
Name:Potassium voltage-gated channel subfamily H member 2
Type:Multi-pass membrane protein
Mol. Mass.:126672.65
Organism:Homo sapiens (Human)
Description:Q12809
Residue:1159
BDBM50088378
NameBDBM50088378
Synonyms:Afinitor CHEBI:68478 RAD001 | Zortress
TypeSmall organic molecule
Emp. Form.C53H83NO14
Mol. Mass.958.2244
SMILES[H][C@@]12CC[C@@H](C)[C@@](O)(O1)C(=O)C(=O)N1CCCC[C@@]1([H])C(=O)O[C@@]([H])(CC(=O)[C@H](C)\C=C(C)\[C@@H](O)[C@@H](OC)C(=O)[C@H](C)C[C@H](C)\C=C\C=C\C=C(C)\[C@H](C2)OC)[C@H](C)C[C@@H]1CC[C@@H](OCCO)[C@@H](C1)OC