Reaction Details
TargetSodium channel protein type 5 subunit alpha
LigandBDBM50103642
Substrate/Competitorn/a
Meas. Tech.ChEMBL_1478525 (CHEMBL3430426)
IC50 501187±n/a nM
Citation Mirams, GRDavies, MRBrough, SJBridgland-Taylor, MHCui, YGavaghan, DJAbi-Gerges, N Prediction of Thorough QT study results using action potential simulations based on ion channel screens. J Pharmacol Toxicol Methods70:246-54 (2014) 
 
Sodium channel protein type 5 subunit alpha
Name:Sodium channel protein type 5 subunit alpha
Type:Enzyme
Mol. Mass.:226908.60
Organism:Homo sapiens (Human)
Description:Q14524
Residue:2016
BDBM50103642
NameBDBM50103642
Synonyms:4-(6-amino-5-bromo-2-(4-cyanophenylamino)pyrimidin-4-ylamino)-3,5-dimethylbenzonitrile 4-({6-AMINO-5-BROMO-2-[(4-CYANOPHENYL)AMINO]PYRIMIDIN-4-YL}OXY)-3,5-DIMETHYLBENZONITRILE CHEMBL308954 Etravirine (ETR) Etravirine (TMC125) TMC-125
TypeSmall organic molecule
Emp. Form.C20H15BrN6O
Mol. Mass.435.277
SMILESCc1cc(cc(C)c1Oc1nc(Nc2ccc(cc2)C#N)nc(N)c1Br)C#N