Reaction Details
TargetPotassium voltage-gated channel subfamily E/KQT member 1
LigandBDBM50417287
Substrate/Competitorn/a
Meas. Tech.ChEMBL_1478596 (CHEMBL3430497)
IC50 50119±n/a nM
Citation Mirams, GRDavies, MRBrough, SJBridgland-Taylor, MHCui, YGavaghan, DJAbi-Gerges, N Prediction of Thorough QT study results using action potential simulations based on ion channel screens. J Pharmacol Toxicol Methods70:246-54 (2014) 
 
Potassium voltage-gated channel subfamily E/KQT member 1
Name:Potassium voltage-gated channel subfamily E/KQT member 1
Type:n/a
Mol. Mass.:n/a
Description:ASSAY_ID of EBI is 158552
Components:This complex has 2 components.
Component 1
Name:Potassium voltage-gated channel subfamily E member 1
Synonyms:Delayed rectifier potassium channel subunit IsK KCNE1 KCNQ1(Kv7.1)/KCNE1(MinK) Voltage-gated potassium channel beta subunit Mink | Voltage-gated potassium channel, IKs
Type:PROTEIN
Mol. Mass.:14676.11
Organism:Homo sapiens (Human)
Description:ChEMBL_1456351
Residue:129
Component 2
Name:Potassium voltage-gated channel subfamily KQT member 1
Synonyms:KCNA8 KCNQ (Kv7) potassium channel KCNQ1_HUMAN Voltage-gated potassium channel subunit Kv7.1 | Voltage-gated potassium channel subunit Kv7.1/Misshapen-like kinase 1
Type:PROTEIN
Mol. Mass.:74739.00
Organism:Homo sapiens (Human)
Description:ChEMBL_1454245
Residue:676
BDBM50417287
NameBDBM50417287
Synonyms:Aloxi PALONOSETRON | PALONOSETRON HYDROCHLORIDE
TypeSmall organic molecule
Emp. Form.C19H24N2O
Mol. Mass.296.4067
SMILESO=C1N(C[C@H]2CCCc3cccc1c23)[C@@H]1CN2CCC1CC2