Reaction Details
TargetPotassium voltage-gated channel subfamily H member 2
LigandBDBM50160154
Substrate/Competitorn/a
Meas. Tech.ChEMBL_1478814 (CHEMBL3430715)
IC50 25119±n/a nM
Citation Mirams, GRDavies, MRBrough, SJBridgland-Taylor, MHCui, YGavaghan, DJAbi-Gerges, N Prediction of Thorough QT study results using action potential simulations based on ion channel screens. J Pharmacol Toxicol Methods70:246-54 (2014) 
 
Potassium voltage-gated channel subfamily H member 2
Name:Potassium voltage-gated channel subfamily H member 2
Type:Multi-pass membrane protein
Mol. Mass.:126672.65
Organism:Homo sapiens (Human)
Description:Q12809
Residue:1159
BDBM50160154
NameBDBM50160154
Synonyms:1-(3-Hydroxy-propyl)-5-((R)-2-{2-[2-(2,2,2-trifluoro-ethoxy)-phenoxy]-ethylamino}-propyl)-2,3-dihydro-1H-indole-7-carboxylic acid amide SILODOSIN
TypeSmall organic molecule
Emp. Form.C25H32F3N3O4
Mol. Mass.495.5345
SMILESC[C@H](Cc1cc2CCN(CCCO)c2c(c1)C(N)=O)NCCOc1ccccc1OCC(F)(F)F