Reaction Details
TargetSodium channel protein type 5 subunit alpha
LigandBDBM50165008
Substrate/Competitorn/a
Meas. Tech.ChEMBL_1478571 (CHEMBL3430472)
IC50 31623±n/a nM
Citation Mirams, GRDavies, MRBrough, SJBridgland-Taylor, MHCui, YGavaghan, DJAbi-Gerges, N Prediction of Thorough QT study results using action potential simulations based on ion channel screens. J Pharmacol Toxicol Methods70:246-54 (2014) 
 
Sodium channel protein type 5 subunit alpha
Name:Sodium channel protein type 5 subunit alpha
Type:Enzyme
Mol. Mass.:226908.60
Organism:Homo sapiens (Human)
Description:Q14524
Residue:2016
BDBM50165008
NameBDBM50165008
Synonyms:(+)-(R)-2-(alpha-(2-(Diisopropylamino)ethyl)benzyl)-p-cresol 2-[(1R)-3-(diisopropylamino)-1-phenylpropyl]-4-methylphenol TOLTERODINE
TypeSmall organic molecule
Emp. Form.C22H31NO
Mol. Mass.325.4876
SMILESCC(C)N(CC[C@H](c1ccccc1)c1cc(C)ccc1O)C(C)C