Reaction Details
TargetPotassium voltage-gated channel subfamily E/KQT member 1
LigandBDBM50165008
Substrate/Competitorn/a
Meas. Tech.ChEMBL_1478605 (CHEMBL3430506)
IC50 79433±n/a nM
Citation Mirams, GRDavies, MRBrough, SJBridgland-Taylor, MHCui, YGavaghan, DJAbi-Gerges, N Prediction of Thorough QT study results using action potential simulations based on ion channel screens. J Pharmacol Toxicol Methods70:246-54 (2014) 
 
Potassium voltage-gated channel subfamily E/KQT member 1
Name:Potassium voltage-gated channel subfamily E/KQT member 1
Type:n/a
Mol. Mass.:n/a
Description:ASSAY_ID of EBI is 158552
Components:This complex has 2 components.
Component 1
Name:Potassium voltage-gated channel subfamily E member 1
Synonyms:Delayed rectifier potassium channel subunit IsK KCNE1 KCNQ1(Kv7.1)/KCNE1(MinK) Voltage-gated potassium channel beta subunit Mink | Voltage-gated potassium channel, IKs
Type:PROTEIN
Mol. Mass.:14676.11
Organism:Homo sapiens (Human)
Description:ChEMBL_1456351
Residue:129
Component 2
Name:Potassium voltage-gated channel subfamily KQT member 1
Synonyms:KCNA8 KCNQ (Kv7) potassium channel KCNQ1_HUMAN Voltage-gated potassium channel subunit Kv7.1 | Voltage-gated potassium channel subunit Kv7.1/Misshapen-like kinase 1
Type:PROTEIN
Mol. Mass.:74739.00
Organism:Homo sapiens (Human)
Description:ChEMBL_1454245
Residue:676
BDBM50165008
NameBDBM50165008
Synonyms:(+)-(R)-2-(alpha-(2-(Diisopropylamino)ethyl)benzyl)-p-cresol 2-[(1R)-3-(diisopropylamino)-1-phenylpropyl]-4-methylphenol TOLTERODINE
TypeSmall organic molecule
Emp. Form.C22H31NO
Mol. Mass.325.4876
SMILESCC(C)N(CC[C@H](c1ccccc1)c1cc(C)ccc1O)C(C)C