Reaction Details
TargetPotassium voltage-gated channel subfamily H member 2
LigandBDBM50088382
Substrate/Competitorn/a
Meas. Tech.ChEMBL_1478857 (CHEMBL3430329)
IC50 5011872±n/a nM
Citation Mirams, GRDavies, MRBrough, SJBridgland-Taylor, MHCui, YGavaghan, DJAbi-Gerges, N Prediction of Thorough QT study results using action potential simulations based on ion channel screens. J Pharmacol Toxicol Methods70:246-54 (2014) 
 
Potassium voltage-gated channel subfamily H member 2
Name:Potassium voltage-gated channel subfamily H member 2
Type:Multi-pass membrane protein
Mol. Mass.:126672.65
Organism:Homo sapiens (Human)
Description:Q12809
Residue:1159
BDBM50088382
NameBDBM50088382
Synonyms:Doribax Finibax | S-4661
TypeSmall organic molecule
Emp. Form.C15H24N4O6S2
Mol. Mass.420.504
SMILES[H][C@]12[C@@H](C)C(S[C@@H]3CN[C@H](CNS(N)(=O)=O)C3)=C(N1C(=O)[C@]2([H])[C@@H](C)O)C(O)=O