Reaction Details
TargetPotassium voltage-gated channel subfamily H member 2
LigandBDBM4814
Substrate/Competitorn/a
Meas. Tech.ChEMBL_1478817 (CHEMBL3430718)
IC50 10000±n/a nM
Citation Mirams, GRDavies, MRBrough, SJBridgland-Taylor, MHCui, YGavaghan, DJAbi-Gerges, N Prediction of Thorough QT study results using action potential simulations based on ion channel screens. J Pharmacol Toxicol Methods70:246-54 (2014) 
 
Potassium voltage-gated channel subfamily H member 2
Name:Potassium voltage-gated channel subfamily H member 2
Type:Multi-pass membrane protein
Mol. Mass.:126672.65
Organism:Homo sapiens (Human)
Description:Q12809
Residue:1159
BDBM4814
NameBDBM4814
Synonyms:CHEMBL535 N-[2-(diethylamino)ethyl]-5-{[(3Z)-5-fluoro-2-oxo-2,3-dihydro-1H-indol-3-ylidene]methyl}-2,4-dimethyl-1H-pyrrole-3-carboxamide SUNITINIB US10464902, Sunitinib US9163010, Sunitinib | US9914707, SU11248
TypeSmall organic molecule
Emp. Form.C22H27FN4O2
Mol. Mass.398.4738
SMILESCCN(CC)CCNC(=O)c1c(C)[nH]c(\C=C2/C(=O)Nc3ccc(F)cc23)c1C