Reaction Details
TargetVoltage-dependent L-type calcium channel subunit alpha-1C
LigandBDBM50101905
Substrate/Competitorn/a
Meas. Tech.ChEMBL_1479161 (CHEMBL3436137)
IC50 9000±n/a nM
Citation Wisniowska, BMendyk, AFijorek, KGlinka, APolak, S Predictive model for L-type channel inhibition: multichannel block in QT prolongation risk assessment. J Appl Toxicol32:858-66 (2012) 
 
Voltage-dependent L-type calcium channel subunit alpha-1C
Name:Voltage-dependent L-type calcium channel subunit alpha-1C
Type:Enzyme Catalytic Domain
Mol. Mass.:243492.26
Organism:RAT
Description:Calcium channel 0 RAT::P22002
Residue:2169
BDBM50101905
NameBDBM50101905
Synonyms:Fantofarone | SR-33557
TypeSmall organic molecule
Emp. Form.C31H38N2O5S
Mol. Mass.550.709
SMILESCOc1ccc(CCN(C)CCCOc2ccc(cc2)S(=O)(=O)c2c(cn3ccccc23)C(C)C)cc1OC