Reaction Details
TargetVoltage-dependent L-type calcium channel subunit alpha-1C
LigandBDBM50101972
Substrate/Competitorn/a
Meas. Tech.ChEMBL_1479137 (CHEMBL3436113)
IC50 9.0±n/a nM
Citation Wisniowska, BMendyk, AFijorek, KGlinka, APolak, S Predictive model for L-type channel inhibition: multichannel block in QT prolongation risk assessment. J Appl Toxicol32:858-66 (2012) 
 
Voltage-dependent L-type calcium channel subunit alpha-1C
Name:Voltage-dependent L-type calcium channel subunit alpha-1C
Type:PROTEIN
Mol. Mass.:19518.62
Organism:Cavia porcellus
Description:ChEMBL_106600
Residue:169
BDBM50101972
NameBDBM50101972
Synonyms:Iganidipine
TypeSmall organic molecule
Emp. Form.C28H38N4O6
Mol. Mass.526.6245
SMILESCOC(=O)C1=C(C)NC(C)=C(C1c1cccc(c1)[N+]([O-])=O)C(=O)OCC(C)(C)CN1CCN(CC=C)CC1