Reaction Details
TargetVoltage-dependent L-type calcium channel subunit alpha-1C
LigandBDBM50165008
Substrate/Competitorn/a
Meas. Tech.ChEMBL_1479170 (CHEMBL3436146)
IC50 143±n/a nM
Citation Wisniowska, BMendyk, AFijorek, KGlinka, APolak, S Predictive model for L-type channel inhibition: multichannel block in QT prolongation risk assessment. J Appl Toxicol32:858-66 (2012) 
 
Voltage-dependent L-type calcium channel subunit alpha-1C
Name:Voltage-dependent L-type calcium channel subunit alpha-1C
Type:PROTEIN
Mol. Mass.:19518.62
Organism:Cavia porcellus
Description:ChEMBL_106600
Residue:169
BDBM50165008
NameBDBM50165008
Synonyms:(+)-(R)-2-(alpha-(2-(Diisopropylamino)ethyl)benzyl)-p-cresol 2-[(1R)-3-(diisopropylamino)-1-phenylpropyl]-4-methylphenol TOLTERODINE
TypeSmall organic molecule
Emp. Form.C22H31NO
Mol. Mass.325.4876
SMILESCC(C)N(CC[C@H](c1ccccc1)c1cc(C)ccc1O)C(C)C