Reaction Details
TargetVoltage-dependent L-type calcium channel subunit alpha-1C
LigandBDBM50151856
Substrate/Competitorn/a
Meas. Tech.ChEMBL_1479081 (CHEMBL3436057)
IC50 14000±n/a nM
Citation Wisniowska, BMendyk, AFijorek, KGlinka, APolak, S Predictive model for L-type channel inhibition: multichannel block in QT prolongation risk assessment. J Appl Toxicol32:858-66 (2012) 
 
Voltage-dependent L-type calcium channel subunit alpha-1C
Name:Voltage-dependent L-type calcium channel subunit alpha-1C
Type:PROTEIN
Mol. Mass.:19518.62
Organism:Cavia porcellus
Description:ChEMBL_106600
Residue:169
BDBM50151856
NameBDBM50151856
Synonyms:2-(2,2-Diphenyl-cyclopropyl)-4,5-dihydro-1H-imidazole CIBENZOLINE | Cifenline
TypeSmall organic molecule
Emp. Form.C18H18N2
Mol. Mass.262.3489
SMILESC1C(C2=NCCN2)C1(c1ccccc1)c1ccccc1