Reaction Details
TargetBile salt export pump
LigandBDBM50054601
Substrate/Competitorn/a
Meas. Tech.ChEMBL_1481883 (CHEMBL3540574)
IC50 111600±n/a nM
Citation Dawson, SStahl, SPaul, NBarber, JKenna, JG In vitro inhibition of the bile salt export pump correlates with risk of cholestatic drug-induced liver injury in humans. Drug Metab Dispos40:130-8 (2011) 
 
Bile salt export pump
Name:Bile salt export pump
Type:PROTEIN
Mol. Mass.:146267.86
Organism:Rattus norvegicus
Description:ChEMBL_1481883
Residue:1321
BDBM50054601
NameBDBM50054601
Synonyms:5-Methyl-N-(4-(trifluoromethyl)phenyl)-4-isoxazolecarboxamide 5-methyl-N-[4-(trifluoromethyl)phenyl]-1,2-oxazole-4-carboxamide CHEMBL960 alpha,alpha,alpha-Trifluoro-5-methyl-4-isoxazolecarboxy-p-toluidide
TypeSmall organic molecule
Emp. Form.C12H9F3N2O2
Mol. Mass.270.2073
SMILESCc1oncc1C(=O)Nc1ccc(cc1)C(F)(F)F