Reaction Details
TargetBile salt export pump
LigandBDBM50371235
Substrate/Competitorn/a
Meas. Tech.ChEMBL_1481882 (CHEMBL3540573)
IC50 572700±n/a nM
Citation Dawson, SStahl, SPaul, NBarber, JKenna, JG In vitro inhibition of the bile salt export pump correlates with risk of cholestatic drug-induced liver injury in humans. Drug Metab Dispos40:130-8 (2011) 
 
Bile salt export pump
Name:Bile salt export pump
Type:Protein
Mol. Mass.:146405.49
Organism:Homo sapiens (Human)
Description:O95342
Residue:1321
BDBM50371235
NameBDBM50371235
Synonyms:CIPROFIBRATE
TypeSmall organic molecule
Emp. Form.C13H14Cl2O3
Mol. Mass.289.154
SMILESCC(C)(Oc1ccc(cc1)C1CC1(Cl)Cl)C(O)=O