Reaction Details
TargetBile salt export pump
LigandBDBM50088429
Substrate/Competitorn/a
Meas. Tech.ChEMBL_1481882 (CHEMBL3540573)
IC50 18200±n/a nM
Citation Dawson, SStahl, SPaul, NBarber, JKenna, JG In vitro inhibition of the bile salt export pump correlates with risk of cholestatic drug-induced liver injury in humans. Drug Metab Dispos40:130-8 (2011) 
 
Bile salt export pump
Name:Bile salt export pump
Type:Protein
Mol. Mass.:146405.49
Organism:Homo sapiens (Human)
Description:O95342
Residue:1321
BDBM50088429
NameBDBM50088429
Synonyms:Acitretin Etretin Soriatane
TypeSmall organic molecule
Emp. Form.C21H26O3
Mol. Mass.326.4293
SMILESCOc1cc(C)c(\C=C\C(\C)=C\C=C\C(\C)=C\C(O)=O)c(C)c1C