Reaction Details
TargetBile salt export pump
LigandBDBM50108877
Substrate/Competitorn/a
Meas. Tech.ChEMBL_1481882 (CHEMBL3540573)
IC50 119600±n/a nM
Citation Dawson, SStahl, SPaul, NBarber, JKenna, JG In vitro inhibition of the bile salt export pump correlates with risk of cholestatic drug-induced liver injury in humans. Drug Metab Dispos40:130-8 (2011) 
 
Bile salt export pump
Name:Bile salt export pump
Type:Protein
Mol. Mass.:146405.49
Organism:Homo sapiens (Human)
Description:O95342
Residue:1321
BDBM50108877
NameBDBM50108877
Synonyms:(3,4-Dihydroxy-5-nitro-phenyl)-p-tolyl-methanone CHEMBL1324 TOLCAPONE Tasmar
TypeSmall organic molecule
Emp. Form.C14H11NO5
Mol. Mass.273.2408
SMILESCc1ccc(cc1)C(=O)c1cc(O)c(O)c(c1)[N+]([O-])=O