Reaction Details
TargetCytochrome P450 3A4
LigandBDBM50062551
Substrate/Competitorn/a
Meas. Tech.ChEMBL_1493641 (CHEMBL3530057)
IC50 65000±n/a nM
Citation Reese, MJSavina, PMGeneraux, GTTracey, HHumphreys, JEKanaoka, EWebster, LOHarmon, KAClarke, JDPolli, JW In vitro investigations into the roles of drug transporters and metabolizing enzymes in the disposition and drug interactions of dolutegravir, a HIV integrase inhibitor. Drug Metab Dispos41:353-61 (2013) 
 
Cytochrome P450 3A4
Name:Cytochrome P450 3A4
Type:Enzyme
Mol. Mass.:57349.57
Organism:Homo sapiens (Human)
Description:n/a
Residue:503
BDBM50062551
NameBDBM50062551
Synonyms:CHEBI:76010 GSK1349572 | S-349572
TypeSmall organic molecule
Emp. Form.C20H19F2N3O5
Mol. Mass.419.3788
SMILES[H][C@]12Cn3cc(C(=O)NCc4ccc(F)cc4F)c(=O)c(O)c3C(=O)N1[C@H](C)CCO2