Reaction Details
TargetCytochrome P450 3A4
LigandBDBM50088447
Substrate/Competitorn/a
Meas. Tech.ChEMBL_1488914 (CHEMBL3535223)
EC50 5900±n/a nM
Citation Xing, JKirby, BJWhittington, DWan, YGoodlett, DR Evaluation of P450 inhibition and induction by artemisinin antimalarials in human liver microsomes and primary human hepatocytes. Drug Metab Dispos40:1757-64 (2012) 
 
Cytochrome P450 3A4
Name:Cytochrome P450 3A4
Type:Enzyme
Mol. Mass.:57349.57
Organism:Homo sapiens (Human)
Description:n/a
Residue:503
BDBM50088447
NameBDBM50088447
Synonyms:(+)-Artemisinin | CHEBI:223316
TypeSmall organic molecule
Emp. Form.C15H22O5
Mol. Mass.282.3322
SMILES[H][C@@]12CC[C@@H](C)[C@]3([H])CC[C@@]4(C)OO[C@@]13[C@]([H])(OC(=O)[C@@H]2C)O4