Reaction Details
TargetSolute carrier organic anion transporter family member 1B1
LigandBDBM50088491
Substrate/Competitorn/a
Meas. Tech.ChEMBL_1494637 (CHEMBL3529887)
IC50 8500±n/a nM
Citation Köck, KXie, YHawke, RLOberlies, NHBrouwer, KL Interaction of silymarin flavonolignans with organic anion-transporting polypeptides. Drug Metab Dispos41:958-65 (2013) 
 
Solute carrier organic anion transporter family member 1B1
Name:Solute carrier organic anion transporter family member 1B1
Type:Protein
Mol. Mass.:76468.06
Organism:Homo sapiens (Human)
Description:Q9Y6L6
Residue:691
BDBM50088491
NameBDBM50088491
Synonyms:Silybin B
TypeSmall organic molecule
Emp. Form.C25H22O10
Mol. Mass.482.4362
SMILESCOc1cc(ccc1O)[C@@H]1Oc2cc(ccc2O[C@H]1CO)[C@H]1Oc2cc(O)cc(O)c2C(=O)[C@@H]1O