Reaction Details
TargetSolute carrier organic anion transporter family member 1B3
LigandBDBM50442881
Substrate/Competitorn/a
Meas. Tech.ChEMBL_1494638 (CHEMBL3529888)
IC50 2700±n/a nM
Citation Köck, KXie, YHawke, RLOberlies, NHBrouwer, KL Interaction of silymarin flavonolignans with organic anion-transporting polypeptides. Drug Metab Dispos41:958-65 (2013) 
 
Solute carrier organic anion transporter family member 1B3
Name:Solute carrier organic anion transporter family member 1B3
Type:Protein
Mol. Mass.:77425.75
Organism:Homo sapiens (Human)
Description:Q9NPD5
Residue:702
BDBM50442881
NameBDBM50442881
Synonyms:SILYBIN A
TypeSmall organic molecule
Emp. Form.C25H22O10
Mol. Mass.482.4362
SMILESCOc1cc(ccc1O)[C@H]1Oc2cc(ccc2O[C@@H]1CO)[C@H]1Oc2cc(O)cc(O)c2C(O)C1=O