Reaction Details
TargetNuclear receptor subfamily 1 group I member 2
LigandBDBM50030477
Substrate/Competitorn/a
Meas. Tech.ChEMBL_1487572 (CHEMBL3531878)
EC50 440±n/a nM
Citation Shukla, SJSakamuru, SHuang, RMoeller, TAShinn, PVanleer, DAuld, DSAustin, CPXia, M Identification of clinically used drugs that activate pregnane X receptors. Drug Metab Dispos39:151-9 (2010) 
 
Nuclear receptor subfamily 1 group I member 2
Name:Nuclear receptor subfamily 1 group I member 2
Type:Nuclear receptor
Mol. Mass.:49774.77
Organism:Homo sapiens (Human)
Description:O75469
Residue:434
BDBM50030477
NameBDBM50030477
Synonyms:CHEBI:77317 SR-12813
TypeSmall organic molecule
Emp. Form.C24H42O7P2
Mol. Mass.504.5336
SMILES[#6]-[#6]-[#8]P(=O)([#8]-[#6]-[#6])[#6](=[#6]\c1cc(c(-[#8])c(c1)C([#6])([#6])[#6])C([#6])([#6])[#6])\P(=O)([#8]-[#6]-[#6])[#8]-[#6]-[#6]