Reaction Details
TargetNuclear receptor subfamily 1 group I member 2
LigandBDBM50103617
Substrate/Competitorn/a
Meas. Tech.ChEMBL_1487572 (CHEMBL3531878)
EC50 15800±n/a nM
Citation Shukla, SJSakamuru, SHuang, RMoeller, TAShinn, PVanleer, DAuld, DSAustin, CPXia, M Identification of clinically used drugs that activate pregnane X receptors. Drug Metab Dispos39:151-9 (2010) 
 
Nuclear receptor subfamily 1 group I member 2
Name:Nuclear receptor subfamily 1 group I member 2
Type:Nuclear receptor
Mol. Mass.:49774.77
Organism:Homo sapiens (Human)
Description:O75469
Residue:434
BDBM50103617
NameBDBM50103617
Synonyms:CHEMBL451483
TypeSmall organic molecule
Emp. Form.C52H76O24
Mol. Mass.1085.1454
SMILES[H][C@@]1(C[C@@H](O)[C@H](O)[C@@H](C)O1)O[C@@H]1C[C@H](Oc2cc3cc4C[C@@]([H])([C@H](OC)C(=O)[C@@H](O)[C@@H](C)O)[C@]([H])(O[C@H]5C[C@@H](O[C@@]6([H])C[C@@H](O[C@@]7([H])C[C@](C)(O)[C@H](O)[C@@H](C)O7)[C@H](O)[C@@H](C)O6)[C@H](O)[C@@H](C)O5)C(=O)c4c(O)c3c(O)c2C)O[C@H](C)[C@H]1O