Reaction Details
TargetNuclear receptor subfamily 1 group I member 2
LigandBDBM50103609
Substrate/Competitorn/a
Meas. Tech.ChEMBL_1487572 (CHEMBL3531878)
EC50 5000±n/a nM
Citation Shukla, SJSakamuru, SHuang, RMoeller, TAShinn, PVanleer, DAuld, DSAustin, CPXia, M Identification of clinically used drugs that activate pregnane X receptors. Drug Metab Dispos39:151-9 (2010) 
 
Nuclear receptor subfamily 1 group I member 2
Name:Nuclear receptor subfamily 1 group I member 2
Type:Nuclear receptor
Mol. Mass.:49774.77
Organism:Homo sapiens (Human)
Description:O75469
Residue:434
BDBM50103609
NameBDBM50103609
Synonyms:Enzacamene | Methyl Benzylidene Camphor
TypeSmall organic molecule
Emp. Form.C18H22O
Mol. Mass.254.3667
SMILESCc1ccc(\C=C2/C3CCC(C)(C2=O)C3(C)C)cc1