Reaction Details
TargetNuclear receptor subfamily 1 group I member 2
LigandBDBM50103628
Substrate/Competitorn/a
Meas. Tech.ChEMBL_1487568 (CHEMBL3531874)
EC50 4500±n/a nM
Citation Shukla, SJSakamuru, SHuang, RMoeller, TAShinn, PVanleer, DAuld, DSAustin, CPXia, M Identification of clinically used drugs that activate pregnane X receptors. Drug Metab Dispos39:151-9 (2010) 
 
Nuclear receptor subfamily 1 group I member 2
Name:Nuclear receptor subfamily 1 group I member 2
Type:PROTEIN
Mol. Mass.:49664.53
Organism:Rattus norvegicus
Description:ChEMBL_105143
Residue:431
BDBM50103628
NameBDBM50103628
Synonyms:CHEMBL1702784
TypeSmall organic molecule
Emp. Form.C16H14OS2
Mol. Mass.286.412
SMILESO=C1\C(CCC\C1=C\c1cccs1)=C/c1cccs1